BDBM50578339 CHEMBL4875081
SMILES COc1ccc(Cl)cc1[C@H]1C[C@@H]1CNCCCOc1ccc2ccc(=O)[nH]c2c1
InChI Key
Data  13 KI  12 EC50
  Tab Delimited (TSV)   2D SDfile   Computed 3D by Vconf -m prep SDfile
Find this compound or compounds like it in BindingDB:
Activity Spreadsheet -- Enzyme Inhibition Constant Data from BindingDB
Found 25 hits for monomerid = 50578339
TargetD(2) dopamine receptor(Homo sapiens (Human))
Shanghaitech University
Curated by ChEMBL
LigandPNGBDBM50578339(CHEMBL4875081)
Affinity DataKi:  13nM. Assay description: Displacement of [3H]-N-methylspiperone from D2 receptor (unknown origin) expressed in HEK293T cell membranes measured after 2 hrs by microbeta scinti...
Ligand InfoPC cidPC sid
In DepthDetails ArticlePubMed
TargetD(2) dopamine receptor(Homo sapiens (Human))
Shanghaitech University
Curated by ChEMBL
LigandPNGBDBM50578339(CHEMBL4875081)
Affinity DataKi:  13nM. Assay description: Displacement of [3H]-N-methylspiperone from D2 receptor (unknown origin) expressed in HEK293T cell membranes measured after 2 hrs by microbeta scinti...
Ligand InfoPC cidPC sid
In DepthDetails ArticlePubMed
Target5-hydroxytryptamine receptor 1A(Homo sapiens (Human))
Shanghaitech University
Curated by ChEMBL
LigandPNGBDBM50578339(CHEMBL4875081)
Affinity DataKi:  33nM. Assay description: Displacement of [3H]-LSD from 5HT1A receptor (unknown origin) expressed in HEK293T cell membranes measured after 2 hrs by microbeta scintillation cou...
Ligand InfoPC cidPC sid
In DepthDetails ArticlePubMed
Target5-hydroxytryptamine receptor 1A(Homo sapiens (Human))
Shanghaitech University
Curated by ChEMBL
LigandPNGBDBM50578339(CHEMBL4875081)
Affinity DataKi:  33nM. Assay description: Displacement of [3H]-LSD from 5HT1A receptor (unknown origin) expressed in HEK293T cell membranes measured after 2 hrs by microbeta scintillation cou...
Ligand InfoPC cidPC sid
In DepthDetails ArticlePubMed
TargetD(3) dopamine receptor(Homo sapiens)
Shanghaitech University
Curated by ChEMBL
LigandPNGBDBM50578339(CHEMBL4875081)
Affinity DataKi:  34nM. Assay description: Displacement of [3H]-SCH23390 from D3 receptor (unknown origin) expressed in HEK293T cell membranes measured after 2 hrs by microbeta scintillation c...
Ligand InfoPC cidPC sid
In DepthDetails ArticlePubMed
TargetD(3) dopamine receptor(Homo sapiens)
Shanghaitech University
Curated by ChEMBL
LigandPNGBDBM50578339(CHEMBL4875081)
Affinity DataKi:  34nM. Assay description: Displacement of [3H]-SCH23390 from D3 receptor (unknown origin) expressed in HEK293T cell membranes measured after 2 hrs by microbeta scintillation c...
Ligand InfoPC cidPC sid
In DepthDetails ArticlePubMed
TargetD(4) dopamine receptor(Homo sapiens (Human))
Shanghaitech University
Curated by ChEMBL
LigandPNGBDBM50578339(CHEMBL4875081)
Affinity DataKi:  603nM. Assay description: Displacement of [3H]-SCH23390 from D4 receptor (unknown origin) expressed in HEK293T cell membranes measured after 2 hrs by microbeta scintillation c...
Ligand InfoPC cidPC sid
In DepthDetails ArticlePubMed
Target5-hydroxytryptamine receptor 2C(Homo sapiens)
Shanghaitech University
Curated by ChEMBL
LigandPNGBDBM50578339(CHEMBL4875081)
Affinity DataKi:  603nM. Assay description: Displacement of [3H]-LSD from 5HT2C receptor (unknown origin) expressed in HEK293T cell membranes measured after 2 hrs by microbeta scintillation cou...
Ligand InfoPC cidPC sid
In DepthDetails ArticlePubMed
TargetD(4) dopamine receptor(Homo sapiens (Human))
Shanghaitech University
Curated by ChEMBL
LigandPNGBDBM50578339(CHEMBL4875081)
Affinity DataKi:  604nM. Assay description: Displacement of [3H]-SCH23390 from D4 receptor (unknown origin) expressed in HEK293T cell membranes measured after 2 hrs by microbeta scintillation c...
Ligand InfoPC cidPC sid
In DepthDetails ArticlePubMed
Target5-hydroxytryptamine receptor 2C(Homo sapiens)
Shanghaitech University
Curated by ChEMBL
LigandPNGBDBM50578339(CHEMBL4875081)
Affinity DataKi:  604nM. Assay description: Displacement of [3H]-LSD from 5HT2C receptor (unknown origin) expressed in HEK293T cell membranes measured after 2 hrs by microbeta scintillation cou...
Ligand InfoPC cidPC sid
In DepthDetails ArticlePubMed
Target5-hydroxytryptamine receptor 2A(Homo sapiens (Human))
Shanghaitech University
Curated by ChEMBL
LigandPNGBDBM50578339(CHEMBL4875081)
Affinity DataKi:  1.15E+3nM. Assay description: Displacement of [3H]-LSD from 5HT2A receptor (unknown origin) expressed in HEK293T cell membranes measured after 2 hrs by microbeta scintillation cou...
Ligand InfoPC cidPC sid
In DepthDetails ArticlePubMed
Target5-hydroxytryptamine receptor 2A(Homo sapiens (Human))
Shanghaitech University
Curated by ChEMBL
LigandPNGBDBM50578339(CHEMBL4875081)
Affinity DataKi:  1.16E+3nM. Assay description: Displacement of [3H]-LSD from 5HT2A receptor (unknown origin) expressed in HEK293T cell membranes measured after 2 hrs by microbeta scintillation cou...
Ligand InfoPC cidPC sid
In DepthDetails ArticlePubMed
TargetD(1A) dopamine receptor(Homo sapiens (Human))
Shanghaitech University
Curated by ChEMBL
LigandPNGBDBM50578339(CHEMBL4875081)
Affinity DataKi: >1.00E+4nM. Assay description: Displacement of [3H]-SCH23390 from D1 receptor (unknown origin) expressed in HEK293T cell membranes measured after 2 hrs by microbeta scintillation c...
Ligand InfoPC cidPC sid
In DepthDetails ArticlePubMed
TargetD(2) dopamine receptor(Homo sapiens (Human))
Shanghaitech University
Curated by ChEMBL
LigandPNGBDBM50578339(CHEMBL4875081)
Affinity DataEC50:  8.30nM. Assay description: Partial agonist activity at D2 receptor (unknown origin) expressed in HEK293T cells co-expressing GFP2-beta-arrestin2 assessed as beta-arrestin2 recr...
Ligand InfoPC cidPC sid
In DepthDetails ArticlePubMed
TargetD(2) dopamine receptor(Homo sapiens (Human))
Shanghaitech University
Curated by ChEMBL
LigandPNGBDBM50578339(CHEMBL4875081)
Affinity DataEC50:  3.40nM. Assay description: Partial agonist activity at D2 receptor (unknown origin) expressed in HEK293T cells co-expressing Rluc8-tagged Galpahi1 assessed as Galphai1 dissocia...
Ligand InfoPC cidPC sid
In DepthDetails ArticlePubMed
TargetD(2) dopamine receptor(Homo sapiens (Human))
Shanghaitech University
Curated by ChEMBL
LigandPNGBDBM50578339(CHEMBL4875081)
Affinity DataEC50:  3.40nM. Assay description: Partial agonist activity at D2 receptor (unknown origin) expressed in HEK293T cells co-expressing Rluc8-tagged Galpahi1 assessed as Galphai1 dissocia...
Ligand InfoPC cidPC sid
In DepthDetails ArticlePubMed
TargetD(2) dopamine receptor(Homo sapiens (Human))
Shanghaitech University
Curated by ChEMBL
LigandPNGBDBM50578339(CHEMBL4875081)
Affinity DataEC50:  2nM. Assay description: Partial agonist activity at D2 receptor (unknown origin) expressed in HEK293T cells co-expressing GalphaoA preincubated for 2 mins with coelenterazin...
Ligand InfoPC cidPC sid
In DepthDetails ArticlePubMed
TargetD(3) dopamine receptor(Homo sapiens)
Shanghaitech University
Curated by ChEMBL
LigandPNGBDBM50578339(CHEMBL4875081)
Affinity DataEC50:  129nM. Assay description: Partial agonist activity at D3 receptor (unknown origin) expressed in HEK293T cells co-expressing GalphaoA preincubated for 2 mins with coelenterazin...
Ligand InfoPC cidPC sid
In DepthDetails ArticlePubMed
TargetD(3) dopamine receptor(Homo sapiens)
Shanghaitech University
Curated by ChEMBL
LigandPNGBDBM50578339(CHEMBL4875081)
Affinity DataEC50:  129nM. Assay description: Partial agonist activity at D3 receptor (unknown origin) expressed in HEK293T cells co-expressing GalphaoA preincubated for 2 mins with coelenterazin...
Ligand InfoPC cidPC sid
In DepthDetails ArticlePubMed
TargetD(3) dopamine receptor(Homo sapiens)
Shanghaitech University
Curated by ChEMBL
LigandPNGBDBM50578339(CHEMBL4875081)
Affinity DataEC50:  13nM. Assay description: Partial agonist activity at D3 receptor (unknown origin) expressed in HEK293T cells co-expressing GFP2-beta-arrestin2 assessed as beta-arrestin2 recr...
Ligand InfoPC cidPC sid
In DepthDetails ArticlePubMed
TargetD(3) dopamine receptor(Homo sapiens)
Shanghaitech University
Curated by ChEMBL
LigandPNGBDBM50578339(CHEMBL4875081)
Affinity DataEC50:  13nM. Assay description: Partial agonist activity at D3 receptor (unknown origin) expressed in HEK293T cells co-expressing GFP2-beta-arrestin2 assessed as beta-arrestin2 recr...
Ligand InfoPC cidPC sid
In DepthDetails ArticlePubMed
Target5-hydroxytryptamine receptor 1A(Homo sapiens (Human))
Shanghaitech University
Curated by ChEMBL
LigandPNGBDBM50578339(CHEMBL4875081)
Affinity DataEC50:  59nM. Assay description: Partial agonist activity at 5HT1A receptor (unknown origin) expressed in HEK293T cells co-expressing Rluc8-tagged Galpahi1 preincubated for 2 mins wi...
Ligand InfoPC cidPC sid
In DepthDetails ArticlePubMed
TargetD(2) dopamine receptor(Homo sapiens (Human))
Shanghaitech University
Curated by ChEMBL
LigandPNGBDBM50578339(CHEMBL4875081)
Affinity DataEC50:  8.30nM. Assay description: Partial agonist activity at D2 receptor (unknown origin) expressed in HEK293T cells co-expressing GFP2-beta-arrestin2 assessed as beta-arrestin2 recr...
Ligand InfoPC cidPC sid
In DepthDetails ArticlePubMed
Target5-hydroxytryptamine receptor 1A(Homo sapiens (Human))
Shanghaitech University
Curated by ChEMBL
LigandPNGBDBM50578339(CHEMBL4875081)
Affinity DataEC50:  59nM. Assay description: Partial agonist activity at 5HT1A receptor (unknown origin) expressed in HEK293T cells co-expressing Rluc8-tagged Galpahi1 preincubated for 2 mins wi...
Ligand InfoPC cidPC sid
In DepthDetails ArticlePubMed
TargetD(2) dopamine receptor(Homo sapiens (Human))
Shanghaitech University
Curated by ChEMBL
LigandPNGBDBM50578339(CHEMBL4875081)
Affinity DataEC50:  2nM. Assay description: Partial agonist activity at D2 receptor (unknown origin) expressed in HEK293T cells co-expressing GalphaoA preincubated for 2 mins with coelenterazin...
Ligand InfoPC cidPC sid
In DepthDetails ArticlePubMed