BDBM50578348 CHEMBL4848796
SMILES CO[C@H]1CC[C@@H](CC1)Nc1ncc(C(N)=O)c(N[C@H]2CCC[C@H](O)C2)n1
InChI Key InChIKey=DNQLQDZACRVRIW-XUXIUFHCSA-N
Data  3 IC50
  Tab Delimited (TSV)   2D SDfile   Computed 3D by Vconf -m prep SDfile
Find this compound or compounds like it in BindingDB:
Activity Spreadsheet -- Enzyme Inhibition Constant Data from BindingDB
Found 3 hits for monomerid = 50578348
TargetMitogen-activated protein kinase 8(Mus musculus)
Bristol Myers Squibb
Curated by ChEMBL
LigandPNGBDBM50578348(CHEMBL4848796)
Affinity DataIC50:  6.80E+3nM. Assay description: Inhibition of JNK1 in mouse RAW264.7 cells assessed as inhibition of c-Jun phosphorylation incubated for 30 mins by cellular assay
Ligand InfoPC cidPC sid
In DepthDetails ArticlePubMed
TargetMitogen-activated protein kinase 9(Homo sapiens (Human))
Bristol Myers Squibb
Curated by ChEMBL
LigandPNGBDBM50578348(CHEMBL4848796)
Affinity DataIC50:  114nM. Assay description: Inhibition of JNK2 (unknown origin) assessed as reduction in phosphorylated ULight-labeled 4EBP1 peptide measured after 1 hr by time-resolved fluores...
Ligand InfoPC cidPC sid
In DepthDetails ArticlePubMed
TargetMitogen-activated protein kinase 8(Homo sapiens (Human))
Bristol Myers Squibb
Curated by ChEMBL
LigandPNGBDBM50578348(CHEMBL4848796)
Affinity DataIC50:  52nM. Assay description: Inhibition of JNK1 (unknown origin) assessed as reduction in phosphorylated ULight-labeled 4EBP1 peptide measured after 1 hr by time-resolved fluores...
Ligand InfoPC cidPC sid
In DepthDetails ArticlePubMed