BDBM50578580 CHEMBL4848081
SMILES Brc1ccc(cc1)[C@@H]1CCNC[C@H]1COc1ccc2OCOc2c1
InChI Key InChIKey=SESIBYYWBYIMLH-YOEHRIQHSA-N
Data  1 KI
PDB links: 2 PDB IDs match this monomer.
  Tab Delimited (TSV)   2D SDfile   Computed 3D by Vconf -m prep SDfile
Find this compound or compounds like it in BindingDB:
Activity Spreadsheet -- Enzyme Inhibition Constant Data from BindingDB
Found 1 hit for monomerid = 50578580
TargetSodium-dependent serotonin transporter(Homo sapiens (Human))
Polish Academy Of Sciences
Curated by ChEMBL
LigandPNGBDBM50578580(CHEMBL4848081)
Affinity DataKi:  1.10nM. Assay description: Displacement of [125I]RTI55 binding from human wild type SERT
Ligand InfoPC cidPC sidPDB