BDBM50578858 CHEMBL4877231
SMILES COc1cc(F)c2nc(sc2c1)-c1cc(C)cc2c1ncn(CC#C)c2=O
InChI Key InChIKey=GWYBUHKRXIKSSL-UHFFFAOYSA-N
Data  1 IC50
  Tab Delimited (TSV)   2D SDfile   Computed 3D by Vconf -m prep SDfile
Find this compound or compounds like it in BindingDB:
Activity Spreadsheet -- Enzyme Inhibition Constant Data from BindingDB
Found 1 hit for monomerid = 50578858
TargetProteinase-activated receptor 4(Mus musculus)
China Pharmaceutical University
Curated by ChEMBL
LigandPNGBDBM50578858(CHEMBL4877231)
Affinity DataIC50:  4.20E+3nM. Assay description: Antagonist activity at PAR4 in ICR mouse platelet-rich plasma assessed as inhibition of PAR4 AP AYPGKF-NH2-induced platelet aggregation by photo-turb...
Ligand InfoPC cidPC sid
In DepthDetails ArticlePubMed