BDBM50578869 CHEMBL4877639
SMILES CCCCc1cc(-c2nc3CCCCc3s2)c2ncn(C)c(=O)c2c1
InChI Key InChIKey=KXPSWVRJNVRAFQ-UHFFFAOYSA-N
Data  1 IC50
  Tab Delimited (TSV)   2D SDfile   Computed 3D by Vconf -m prep SDfile
Find this compound or compounds like it in BindingDB:
Activity Spreadsheet -- Enzyme Inhibition Constant Data from BindingDB
Found 1 hit for monomerid = 50578869
TargetProteinase-activated receptor 4(Mus musculus)
China Pharmaceutical University
Curated by ChEMBL
LigandPNGBDBM50578869(CHEMBL4877639)
Affinity DataIC50:  7.04E+3nM. Assay description: Antagonist activity at PAR4 in ICR mouse platelet-rich plasma assessed as inhibition of PAR4 AP AYPGKF-NH2-induced platelet aggregation by photo-turb...
Ligand InfoPC cidPC sid
In DepthDetails ArticlePubMed