BDBM50578878 CHEMBL4849478
SMILES Cc1cc(-c2nc3c(Cl)cc(OCCNS(=O)(=O)c4ccc(Cl)cc4Cl)cc3s2)c2ncn(C)c(=O)c2c1
InChI Key InChIKey=UWAHKTMJFQUAFV-UHFFFAOYSA-N
Data  1 IC50
  Tab Delimited (TSV)   2D SDfile   Computed 3D by Vconf -m prep SDfile
Find this compound or compounds like it in BindingDB:
Activity Spreadsheet -- Enzyme Inhibition Constant Data from BindingDB
Found 1 hit for monomerid = 50578878
TargetProteinase-activated receptor 4(Mus musculus)
China Pharmaceutical University
Curated by ChEMBL
LigandPNGBDBM50578878(CHEMBL4849478)
Affinity DataIC50:  950nM. Assay description: Antagonist activity at PAR4 in ICR mouse platelet-rich plasma assessed as inhibition of PAR4 AP AYPGKF-NH2-induced platelet aggregation by photo-turb...
Ligand InfoPC cidPC sid
In DepthDetails ArticlePubMed