BDBM50579333 CHEMBL4868597
SMILES COc1ccc(CNCCNCCOc2cccc3n(ccc23)S(=O)(=O)c2ccccc2)cc1
InChI Key InChIKey=MFRQMIJNSWPORL-UHFFFAOYSA-N
Data  1 KI  1 IC50
  Tab Delimited (TSV)   2D SDfile   Computed 3D by Vconf -m prep SDfile
Find this compound or compounds like it in BindingDB:
Activity Spreadsheet -- Enzyme Inhibition Constant Data from BindingDB
Found 2 hits for monomerid = 50579333
Target5-hydroxytryptamine receptor 6(Homo sapiens (Human))
Jagiellonian University Medical College
Curated by ChEMBL
LigandPNGBDBM50579333(CHEMBL4868597)
Affinity DataKi:  3.5nM. Assay description: Displacement of [3H]-LSD from human 5HT6R expressed in CHO-K1 cell membranes incubated for 1 hr by scintillation counter method
Ligand InfoPC cidPC sid
In DepthDetails ArticlePubMed
TargetCholinesterase(Equus caballus (Horse))
Jagiellonian University Medical College
Curated by ChEMBL
LigandPNGBDBM50579333(CHEMBL4868597)
Affinity DataIC50:  2.07E+3nM. Assay description: Inhibition of equine serum BuChE using butyrylthiocholine as substrate incubated for 5 mins followed by substrate addition and measured after 5 mins ...
Ligand InfoPC cidPC sid
In DepthDetails ArticlePubMed