BDBM50579342 CHEMBL4872586
SMILES CN1CCN(CC1)c1nc2ccccc2c2n(ccc12)S(=O)(=O)c1cccc(Cl)c1
InChI Key InChIKey=IKMRHWBCXJOAEI-UHFFFAOYSA-N
Data  1 KI
  Tab Delimited (TSV)   2D SDfile   Computed 3D by Vconf -m prep SDfile
Find this compound or compounds like it in BindingDB:
Activity Spreadsheet -- Enzyme Inhibition Constant Data from BindingDB
Found 1 hit for monomerid = 50579342
Target5-hydroxytryptamine receptor 6(Homo sapiens (Human))
Jagiellonian University Medical College
Curated by ChEMBL
LigandPNGBDBM50579342(CHEMBL4872586)
Affinity DataKi:  2nM. Assay description: Displacement of [3H]-LSD from human 5HT6 receptor expressed in HEK293 cell membranes measured after 1 hr by microbeta counting method
Ligand InfoPC cidPC sid
In DepthDetails ArticlePubMed