BDBM50579430 CHEMBL4852144
SMILES Cc1nc2c3cc(ccc3[nH]c(=O)n2n1)-c1ccncc1C
InChI Key InChIKey=TURWMKIIRLXJSR-UHFFFAOYSA-N
Data  1 Kd
  Tab Delimited (TSV)   2D SDfile   Computed 3D by Vconf -m prep SDfile
Find this compound or compounds like it in BindingDB:
Activity Spreadsheet -- Enzyme Inhibition Constant Data from BindingDB
Found 1 hit for monomerid = 50579430
TargetHepatitis A virus cellular receptor 2(Homo sapiens)
Vanderbilt University School Of Medicine
Curated by ChEMBL
LigandPNGBDBM50579430(CHEMBL4852144)
Affinity DataKd:  5.00E+4nM. Assay description: Binding affinity to human TIM-3 IgV domain (residues 22 to 130) expressed in Escherichia coli BL21 (DE3) by 1H-15N SOFAST-HMQC spectroscopic analysis
Ligand InfoPC cidPC sid
In DepthDetails ArticlePubMed