BDBM50579448 CHEMBL4851756
SMILES Cc1nc2c3cc(c(Cl)cc3[nH]c(=O)n2n1)-c1cccc2[nH]ccc12
InChI Key InChIKey=ARPHPJVBZDTLAH-UHFFFAOYSA-N
Data  1 KI
  Tab Delimited (TSV)   2D SDfile   Computed 3D by Vconf -m prep SDfile
Find this compound or compounds like it in BindingDB:
Activity Spreadsheet -- Enzyme Inhibition Constant Data from BindingDB
Found 1 hit for monomerid = 50579448
TargetHepatitis A virus cellular receptor 2(Homo sapiens)
Vanderbilt University School Of Medicine
Curated by ChEMBL
LigandPNGBDBM50579448(CHEMBL4851756)
Affinity DataKi:  1.80E+3nM. Assay description: Displacement of FITC-labelled 5-(((8-Chloro-9-(3-methylpyridin-4-yl)-5-oxo-5,6-dihydro-[1,2,4]triazolo[1,5-c]quinazolin-2-yl)methyl)carbamoyl)-2-(6-h...
Ligand InfoPC cidPC sid
In DepthDetails ArticlePubMed