BDBM50579610 CHEMBL4873520
SMILES [H][C@]12CN[C@](CCN1)([C@H]2CCCB(O)O)C(O)=O
InChI Key InChIKey=XKVDELGPCBFNNZ-QXFUBDJGSA-N
Data  1 IC50
  Tab Delimited (TSV)   2D SDfile   Computed 3D by Vconf -m prep SDfile
Find this compound or compounds like it in BindingDB:
Activity Spreadsheet -- Enzyme Inhibition Constant Data from BindingDB
Found 1 hit for monomerid = 50579610
TargetArginase-1(Homo sapiens (Human))
Merck
Curated by ChEMBL
LigandPNGBDBM50579610(CHEMBL4873520)
Affinity DataIC50:  2.20nM. Assay description: Inhibition of ARG1 (unknown origin) assessed as reduction in thio-ornithine production using thioarginine as substrate by fluorimetric analysis
Ligand InfoPC cidPC sid
In DepthDetails ArticlePubMed