BDBM50579611 CHEMBL4871097
SMILES [H][C@]12C[C@](CCN1)([C@H]2CCCB(O)O)C(O)=O
InChI Key InChIKey=XWFBRGSZHMJBLV-QXFUBDJGSA-N
Data  1 IC50
  Tab Delimited (TSV)   2D SDfile   Computed 3D by Vconf -m prep SDfile
Find this compound or compounds like it in BindingDB:
Activity Spreadsheet -- Enzyme Inhibition Constant Data from BindingDB
Found 1 hit for monomerid = 50579611
TargetArginase-1(Homo sapiens (Human))
Merck
Curated by ChEMBL
LigandPNGBDBM50579611(CHEMBL4871097)
Affinity DataIC50:  3.90nM. Assay description: Inhibition of ARG1 (unknown origin) assessed as reduction in thio-ornithine production using thioarginine as substrate by fluorimetric analysis
Ligand InfoPC cidPC sid
In DepthDetails ArticlePubMed