BDBM50579927 CHEMBL4161234
SMILES COc1nc(cc(-c2ccc(Cl)cc2Cl)c1C#N)-c1ccccc1
InChI Key InChIKey=OESRAUZZSUXVPD-UHFFFAOYSA-N
Data  1 IC50
  Tab Delimited (TSV)   2D SDfile   Computed 3D by Vconf -m prep SDfile
Find this compound or compounds like it in BindingDB:
Activity Spreadsheet -- Enzyme Inhibition Constant Data from BindingDB
Found 1 hit for monomerid = 50579927
TargetSulfide:quinone oxidoreductase, mitochondrial(Homo sapiens)
Fox Chase Chemical Diversity Center
Curated by ChEMBL
LigandPNGBDBM50579927(CHEMBL4161234)
Affinity DataIC50: >1.00E+5nM. Assay description: Inhibition of human SQOR
Ligand InfoPC cidPC sid
In DepthDetails ArticlePubMed