BDBM50579934 CHEMBL5078297
SMILES COc1nc(cc(-c2ccc(F)cc2)c1C#N)-c1ccccn1
InChI Key InChIKey=OBPKAOGZDKORTR-UHFFFAOYSA-N
Data  1 IC50
  Tab Delimited (TSV)   2D SDfile   Computed 3D by Vconf -m prep SDfile
Find this compound or compounds like it in BindingDB:
Activity Spreadsheet -- Enzyme Inhibition Constant Data from BindingDB
Found 1 hit for monomerid = 50579934
TargetSulfide:quinone oxidoreductase, mitochondrial(Homo sapiens)
Fox Chase Chemical Diversity Center
Curated by ChEMBL
LigandPNGBDBM50579934(CHEMBL5078297)
Affinity DataIC50:  14nM. Assay description: Inhibition of human SQOR
Ligand InfoPC cidPC sid
In DepthDetails ArticlePubMed