BDBM50579942 CHEMBL5078802
SMILES CCOC(=O)COc1nc(cc(-c2ccccc2)c1C#N)-c1ccccc1
InChI Key InChIKey=PZNJITRXQKRPFY-UHFFFAOYSA-N
Data  1 IC50
  Tab Delimited (TSV)   2D SDfile   Computed 3D by Vconf -m prep SDfile
Find this compound or compounds like it in BindingDB:
Activity Spreadsheet -- Enzyme Inhibition Constant Data from BindingDB
Found 1 hit for monomerid = 50579942
TargetSulfide:quinone oxidoreductase, mitochondrial(Homo sapiens)
Fox Chase Chemical Diversity Center
Curated by ChEMBL
LigandPNGBDBM50579942(CHEMBL5078802)
Affinity DataIC50:  30nM. Assay description: Inhibition of human SQOR
In DepthDetails ArticlePubMed