BDBM50580567 CHEMBL5070124
SMILES CC(C)N(C)CC(O)COc1cccc2ccccc12
InChI Key InChIKey=LVHDXWKCKMZLRV-UHFFFAOYSA-N
Data  1 EC50
  Tab Delimited (TSV)   2D SDfile   Computed 3D by Vconf -m prep SDfile
Find this compound or compounds like it in BindingDB:
Activity Spreadsheet -- Enzyme Inhibition Constant Data from BindingDB
Found 1 hit for monomerid = 50580567
TargetNuclear receptor subfamily 2 group E member 1(Homo sapiens)
Goethe-University Frankfurt
Curated by ChEMBL
LigandPNGBDBM50580567(CHEMBL5070124)
Affinity DataEC50: >1.00E+5nM. Assay description: Agonist activity at in human TLX LBD expressed in human HEK293T cells coexpressing Gal4-VP 16 assessed as increase in reporter activity measured afte...
Ligand InfoPC cidPC sid
In DepthDetails ArticlePubMed