BDBM50580863 CHEMBL5070715
SMILES COC(=O)CNC(=O)CN(Cc1cn(CCCOc2c3Cc4cc(cc(Cc5cc(cc(Cc6cc(cc(Cc2cc(c3)C(C)(C)C)c6OCCCn2cc(CN(CC(=O)NCC(=O)OC)C(=O)CCCCCn3cc(CO[C@H]6O[C@H](CO)[C@@H](O)[C@H](O)[C@@H]6O)nn3)nn2)C(C)(C)C)c5OCCCn2cc(CN(CC(=O)NCC(=O)OC)C(=O)CCCCCn3cc(CO[C@H]5O[C@H](CO)[C@@H](O)[C@H](O)[C@@H]5O)nn3)nn2)C(C)(C)C)c4OCCCn2cc(CN(CC(=O)NCC(=O)OC)C(=O)CCCCCn3cc(CO[C@H]4O[C@H](CO)[C@@H](O)[C@H](O)[C@@H]4O)nn3)nn2)C(C)(C)C)nn1)C(=O)CCCCCn1cc(CO[C@H]2O[C@H](CO)[C@@H](O)[C@H](O)[C@@H]2O)nn1
InChI Key InChIKey=CSPVPHCJYQKMTF-NSTFTWSTSA-N
Data  1 IC50
  Tab Delimited (TSV)   2D SDfile   Computed 3D by Vconf -m prep SDfile
Find this compound or compounds like it in BindingDB:
Activity Spreadsheet -- Enzyme Inhibition Constant Data from BindingDB
Found 1 hit for monomerid = 50580863
TargetC-type lectin domain family 4 member M(Homo sapiens)
Universit£
Curated by ChEMBL
LigandPNGBDBM50580863(CHEMBL5070715)
Affinity DataIC50:  4.53E+4nM. Assay description: Inhibition of DC-SIGN extracellular domain (unknown origin) binding to HIV gp120 by surface plasmon resonance analysis
Ligand InfoPC cidPC sid
In DepthDetails ArticlePubMed