BDBM50580864 CHEMBL5077032
SMILES COC(=O)CNC(=O)CN(Cc1cn(CCCOc2c3cc(cc2sc2cc(cc(sc4cc(cc(sc5cc(cc(s3)c5OCCCn3cc(CN(CC(=O)NCC(=O)OC)C(=O)CCCCCn5cc(CO[C@@H]6O[C@@H](C)[C@@H](O)[C@@H](O)[C@@H]6O)nn5)nn3)C(C)(C)C)c4OCCCn3cc(CN(CC(=O)NCC(=O)OC)C(=O)CCCCCn4cc(CO[C@@H]5O[C@@H](C)[C@@H](O)[C@@H](O)[C@@H]5O)nn4)nn3)C(C)(C)C)c2OCCCn2cc(CN(CC(=O)NCC(=O)OC)C(=O)CCCCCn3cc(CO[C@@H]4O[C@@H](C)[C@@H](O)[C@@H](O)[C@@H]4O)nn3)nn2)C(C)(C)C)C(C)(C)C)nn1)C(=O)CCCCCn1cc(CO[C@@H]2O[C@@H](C)[C@@H](O)[C@@H](O)[C@@H]2O)nn1
InChI Key InChIKey=AKEGTHWMJFJHBL-ZRVUYJCFSA-N
Data  3 IC50
  Tab Delimited (TSV)   2D SDfile   Computed 3D by Vconf -m prep SDfile
Find this compound or compounds like it in BindingDB:
Activity Spreadsheet -- Enzyme Inhibition Constant Data from BindingDB
Found 3 hits for monomerid = 50580864
TargetC-type lectin domain family 4 member M(Homo sapiens)
Universit£
Curated by ChEMBL
LigandPNGBDBM50580864(CHEMBL5077032)
Affinity DataIC50:  1.70E+4nM. Assay description: Inhibition of DC-SIGN extracellular domain (unknown origin) binding to HIV gp120 by surface plasmon resonance analysis
Ligand InfoPC cidPC sid
In DepthDetails ArticlePubMed
TargetC-type lectin domain family 4 member M(Homo sapiens)
Universit£
Curated by ChEMBL
LigandPNGBDBM50580864(CHEMBL5077032)
Affinity DataIC50:  602nM. Assay description: Inhibition of DC-SIGN (unknown origin) expressed in human Jurkat cells assessed as inhibition of EBOV-pseudotyped virus infection measured after 48 h...
Ligand InfoPC cidPC sid
In DepthDetails ArticlePubMed
TargetC-type lectin domain family 4 member M(Homo sapiens)
Universit£
Curated by ChEMBL
LigandPNGBDBM50580864(CHEMBL5077032)
Affinity DataIC50:  1.00E+3nM. Assay description: Inhibition of full-length DC-SIGN (unknown origin) expressed in human monocyte derived dendritic cells assessed as inhibition of binding to recombina...
Ligand InfoPC cidPC sid
In DepthDetails ArticlePubMed