BDBM50581198 CHEMBL5086769
SMILES COc1ccc(cc1OC)[C@H](Cc1c(Cl)c[n+]([O-])cc1Cl)OC(=O)c1ccc(CN(C(=O)O[C@H]2CN3CCC2CC3)c2cccc(O)c2)s1
InChI Key InChIKey=HPUTUJYQVKLZFM-CDZUIXILSA-N
Data  1 KI  1 IC50
  Tab Delimited (TSV)   2D SDfile   Computed 3D by Vconf -m prep SDfile
Find this compound or compounds like it in BindingDB:
Activity Spreadsheet -- Enzyme Inhibition Constant Data from BindingDB
Found 2 hits for monomerid = 50581198
TargetMuscarinic acetylcholine receptor M3(Homo sapiens (Human))
Chiesi Farmaceutici
Curated by ChEMBL
LigandPNGBDBM50581198(CHEMBL5086769)
Affinity DataKi:  0.316nM. Assay description: Displacement of [3H]-N-methyl Scopolamine Chloride from human M3 receptor membranes incubated for 2 hrs by scintillation counting analysis
Ligand InfoPC cidPC sid
In DepthDetails ArticlePubMed
TargetcAMP-specific 3',5'-cyclic phosphodiesterase 4B(Homo sapiens (Human))
Chiesi Farmaceutici
Curated by ChEMBL
LigandPNGBDBM50581198(CHEMBL5086769)
Affinity DataIC50:  0.794nM. Assay description: Inhibition of human recombinant PDE4B2 assessed as reduction in cAMP level incubated for 2 hrs by LANCE Ultra cAMP TR-FRET assay
Ligand InfoPC cidPC sid
In DepthDetails ArticlePubMed