BDBM50581206 CHEMBL5076886
SMILES [H][C@@]12CC[C@]([H])(CC(C1)OC(=O)C(NCc1ccc(s1)C(=O)O[C@@H](Cc1c(Cl)c[n+]([O-])cc1Cl)c1ccc(OC)c(OC)c1)c1ccccc1)N2C
InChI Key InChIKey=WWLARDYNKWZLHG-QIHGRTJTSA-N
Data  2 KI  3 IC50
  Tab Delimited (TSV)   2D SDfile   Computed 3D by Vconf -m prep SDfile
Find this compound or compounds like it in BindingDB:
Activity Spreadsheet -- Enzyme Inhibition Constant Data from BindingDB
Found 5 hits for monomerid = 50581206
TargetMuscarinic acetylcholine receptor M3(Homo sapiens (Human))
Chiesi Farmaceutici
Curated by ChEMBL
LigandPNGBDBM50581206(CHEMBL5076886)
Affinity DataKi:  0.501nM. Assay description: Displacement of [3H]-N-methyl Scopolamine Chloride from human M3 receptor membranes incubated for 2 hrs by scintillation counting analysis
Ligand InfoPC cidPC sid
In DepthDetails ArticlePubMed
TargetMuscarinic acetylcholine receptor M3(Homo sapiens (Human))
Chiesi Farmaceutici
Curated by ChEMBL
LigandPNGBDBM50581206(CHEMBL5076886)
Affinity DataKi:  0.501nM. Assay description: Displacement of [3H]-N-methyl Scopolamine Chloride from human M3 receptor membranes incubated for 2 hrs by scintillation counting analysis
Ligand InfoPC cidPC sid
In DepthDetails ArticlePubMed
TargetcAMP-specific 3',5'-cyclic phosphodiesterase 4B(Homo sapiens (Human))
Chiesi Farmaceutici
Curated by ChEMBL
LigandPNGBDBM50581206(CHEMBL5076886)
Affinity DataIC50:  1nM. Assay description: Inhibition of human recombinant PDE4B2 assessed as reduction in cAMP level incubated for 2 hrs by LANCE Ultra cAMP TR-FRET assay
Ligand InfoPC cidPC sid
In DepthDetails ArticlePubMed
TargetcAMP-specific 3',5'-cyclic phosphodiesterase 4B(Homo sapiens (Human))
Chiesi Farmaceutici
Curated by ChEMBL
LigandPNGBDBM50581206(CHEMBL5076886)
Affinity DataIC50:  1nM. Assay description: Inhibition of human recombinant PDE4B2 assessed as reduction in cAMP level incubated for 2 hrs by LANCE Ultra cAMP TR-FRET assay
Ligand InfoPC cidPC sid
In DepthDetails ArticlePubMed
TargetMuscarinic acetylcholine receptor M3(RAT)
Chiesi Farmaceutici
Curated by ChEMBL
LigandPNGBDBM50581206(CHEMBL5076886)
Affinity DataIC50:  10nM. Assay description: Antagonist activity at muscarinic M3 receptor in rat trachea assessed as inhibition of carbachol-induced contraction
Ligand InfoPC cidPC sid
In DepthDetails ArticlePubMed