BDBM50582660 CHEMBL5078495
SMILES Cn1ccc(n1)-c1cc(Cl)c(Cl)c2[nH]c3CCN(Cc3c12)C(=O)CNC(=O)CN
InChI Key InChIKey=GKYRDJDNSIXZJR-UHFFFAOYSA-N
Data  2 IC50
  Tab Delimited (TSV)   2D SDfile   Computed 3D by Vconf -m prep SDfile
Find this compound or compounds like it in BindingDB:
Activity Spreadsheet -- Enzyme Inhibition Constant Data from BindingDB
Found 2 hits for monomerid = 50582660
TargetCyclic GMP-AMP synthase(Mus musculus)
Shanghai Institute Of Materia Medica (Simm)
Curated by ChEMBL
LigandPNGBDBM50582660(CHEMBL5078495)
Affinity DataIC50:  1.14E+4nM. Assay description: Inhibition of mouse cGAS expressed in RAW-Lucia ISG transfected with HT-DNA assessed as suppression of lipofectamine 2000:ds-DNA complex induced acti...
Ligand InfoPC cidPC sid
In DepthDetails ArticlePubMed
TargetCyclic GMP-AMP synthase(Homo sapiens)
Shanghai Institute Of Materia Medica (Simm)
Curated by ChEMBL
LigandPNGBDBM50582660(CHEMBL5078495)
Affinity DataIC50:  1.38E+3nM. Assay description: Inhibition of human cGAS expressed in THP1-Dual cells transfected with HT-DNA assessed as suppression of lipofectamine 2000:ds-DNA complex induced ac...
Ligand InfoPC cidPC sid
In DepthDetails ArticlePubMed