BDBM50582671 CHEMBL5094328
SMILES Cc1ccc(OC(F)(F)C(=O)NCC(=O)N2CCc3[nH]c4c(Cl)c(Cl)cc(-c5ccn(C)n5)c4c3C2)cc1
InChI Key InChIKey=HLSDREPYQOVXEQ-UHFFFAOYSA-N
Data  2 IC50
  Tab Delimited (TSV)   2D SDfile   Computed 3D by Vconf -m prep SDfile
Find this compound or compounds like it in BindingDB:
Activity Spreadsheet -- Enzyme Inhibition Constant Data from BindingDB
Found 2 hits for monomerid = 50582671
TargetCyclic GMP-AMP synthase(Mus musculus)
Shanghai Institute Of Materia Medica (Simm)
Curated by ChEMBL
LigandPNGBDBM50582671(CHEMBL5094328)
Affinity DataIC50:  6.69E+3nM. Assay description: Inhibition of mouse cGAS expressed in RAW-Lucia ISG transfected with HT-DNA assessed as suppression of lipofectamine 2000:ds-DNA complex induced acti...
Ligand InfoPC cidPC sid
In DepthDetails ArticlePubMed
TargetCyclic GMP-AMP synthase(Homo sapiens)
Shanghai Institute Of Materia Medica (Simm)
Curated by ChEMBL
LigandPNGBDBM50582671(CHEMBL5094328)
Affinity DataIC50:  1.55E+4nM. Assay description: Inhibition of human cGAS expressed in THP1-Dual cells transfected with HT-DNA assessed as suppression of lipofectamine 2000:ds-DNA complex induced ac...
Ligand InfoPC cidPC sid
In DepthDetails ArticlePubMed