BDBM50582691 CHEMBL5071464
SMILES OCC(=O)N1CCC2Nc3c(ccc(Cl)c3Cl)C2(C1)c1c[nH]c2ccccc12
InChI Key
Data  2 IC50
  Tab Delimited (TSV)   2D SDfile   Computed 3D by Vconf -m prep SDfile
Find this compound or compounds like it in BindingDB:
Activity Spreadsheet -- Enzyme Inhibition Constant Data from BindingDB
Found 2 hits for monomerid = 50582691
TargetCyclic GMP-AMP synthase(Mus musculus)
Shanghai Institute Of Materia Medica (Simm)
Curated by ChEMBL
LigandPNGBDBM50582691(CHEMBL5071464)
Affinity DataIC50:  8.42E+3nM. Assay description: Inhibition of mouse cGAS expressed in RAW-Lucia ISG transfected with HT-DNA assessed as suppression of lipofectamine 2000:ds-DNA complex induced acti...
Ligand InfoPC cidPC sid
In DepthDetails ArticlePubMed
TargetCyclic GMP-AMP synthase(Homo sapiens)
Shanghai Institute Of Materia Medica (Simm)
Curated by ChEMBL
LigandPNGBDBM50582691(CHEMBL5071464)
Affinity DataIC50:  4.07E+3nM. Assay description: Inhibition of human cGAS expressed in THP1-Dual cells transfected with HT-DNA assessed as suppression of lipofectamine 2000:ds-DNA complex induced ac...
Ligand InfoPC cidPC sid
In DepthDetails ArticlePubMed