BDBM50583386 CHEMBL5094601
SMILES CCN(CC)CC.CCN(CC)CC.Cn1c(=O)n(cc\c1=N\OCc1ccccc1Cl)[C@@H]1O[C@H](COP(O)(=O)CP(O)(O)=O)[C@@H](O)[C@H]1O
InChI Key InChIKey=VIBUCBOVGMOZEA-HXKJARSHSA-N
Data  1 KI
  Tab Delimited (TSV)   2D SDfile   Computed 3D by Vconf -m prep SDfile
Find this compound or compounds like it in BindingDB:
Activity Spreadsheet -- Enzyme Inhibition Constant Data from BindingDB
Found 1 hit for monomerid = 50583386
Target5'-nucleotidase(Homo sapiens (Human))
National Institute Of Diabetes And Digestive And Kidney Diseases
Curated by ChEMBL
LigandPNGBDBM50583386(CHEMBL5094601)
Affinity DataKi:  1.60nM. Assay description: Inhibition of human soluble CD73 assessed as inhibition constant
Ligand InfoPC cidPC sid
In DepthDetails ArticlePubMed