BDBM50583401 CHEMBL5089752
SMILES CCN(CC)CC.CCN(CC)CC.Cn1c(=O)n(cc\c1=N\OCc1ccc(cc1)C(=O)NCCCCN)[C@@H]1O[C@H](COP(O)(=O)CP(O)(O)=O)[C@@H](O)[C@H]1O
InChI Key InChIKey=PPTAIWVAMWAIIS-TVPBGLRTSA-N
Data  1 KI
  Tab Delimited (TSV)   2D SDfile   Computed 3D by Vconf -m prep SDfile
Find this compound or compounds like it in BindingDB:
Activity Spreadsheet -- Enzyme Inhibition Constant Data from BindingDB
Found 1 hit for monomerid = 50583401
Target5'-nucleotidase(Homo sapiens (Human))
National Institute Of Diabetes And Digestive And Kidney Diseases
Curated by ChEMBL
LigandPNGBDBM50583401(CHEMBL5089752)
Affinity DataKi:  1.80nM. Assay description: Inhibition of human soluble CD73 assessed as inhibition constant
Ligand InfoPC cidPC sid
In DepthDetails ArticlePubMed