BDBM50583721 CHEMBL5081861
SMILES Nc1cc(cc(N)n1)-c1ccc2occc2n1
InChI Key InChIKey=FPPAJLKYIORDOV-UHFFFAOYSA-N
Data  1 IC50
  Tab Delimited (TSV)   2D SDfile   Computed 3D by Vconf -m prep SDfile
Find this compound or compounds like it in BindingDB:
Activity Spreadsheet -- Enzyme Inhibition Constant Data from BindingDB
Found 1 hit for monomerid = 50583721
TargetDual specificity tyrosine-phosphorylation-regulated kinase 1A(Homo sapiens (Human))
Servier Research Institute Of Medicinal Chemistry
Curated by ChEMBL
LigandPNGBDBM50583721(CHEMBL5081861)
Affinity DataIC50:  10nM. Assay description: Inhibition of DYRK1A (unknown origin) using Ulight-MBP as substrate and ATP as co-substrate incubated for 40 mins and measured after 1 hr by TR-FRET ...
Ligand InfoPC cidPC sid
In DepthDetails ArticlePubMed