BDBM50583730 CHEMBL5094016
SMILES Nc1cc(cc(N)n1)C1=CC2OCCOC2C=C1
InChI Key InChIKey=OLGNFRUMCDPFAG-UHFFFAOYSA-N
Data  1 IC50
  Tab Delimited (TSV)   2D SDfile   Computed 3D by Vconf -m prep SDfile
Find this compound or compounds like it in BindingDB:
Activity Spreadsheet -- Enzyme Inhibition Constant Data from BindingDB
Found 1 hit for monomerid = 50583730
TargetDual specificity tyrosine-phosphorylation-regulated kinase 1A(Homo sapiens (Human))
Servier Research Institute Of Medicinal Chemistry
Curated by ChEMBL
LigandPNGBDBM50583730(CHEMBL5094016)
Affinity DataIC50:  11nM. Assay description: Inhibition of DYRK1A (unknown origin) using Ulight-MBP as substrate and ATP as co-substrate incubated for 40 mins and measured after 1 hr by TR-FRET ...
Ligand InfoPC cidPC sid
In DepthDetails ArticlePubMed