BDBM50583750 CHEMBL5072926
SMILES Cc1nc2ccc(nc2n1CCC1CCCCC1)-c1cc(N)nc(N)c1
InChI Key InChIKey=LCSMODPSWXEJLH-UHFFFAOYSA-N
Data  4 IC50
  Tab Delimited (TSV)   2D SDfile   Computed 3D by Vconf -m prep SDfile
Find this compound or compounds like it in BindingDB:
Activity Spreadsheet -- Enzyme Inhibition Constant Data from BindingDB
Found 4 hits for monomerid = 50583750
TargetDual specificity tyrosine-phosphorylation-regulated kinase 1A(Homo sapiens (Human))
Servier Research Institute Of Medicinal Chemistry
Curated by ChEMBL
LigandPNGBDBM50583750(CHEMBL5072926)
Affinity DataIC50:  4nM. Assay description: Inhibition of DYRK1A (unknown origin) using Ulight-MBP as substrate and ATP as co-substrate incubated for 40 mins and measured after 1 hr by TR-FRET ...
Ligand InfoPC cidPC sid
In DepthDetails ArticlePubMed
TargetDual specificity tyrosine-phosphorylation-regulated kinase 1A(Homo sapiens (Human))
Servier Research Institute Of Medicinal Chemistry
Curated by ChEMBL
LigandPNGBDBM50583750(CHEMBL5072926)
Affinity DataIC50:  110nM. Assay description: Inhibition of wild type full length DYRK1A (unknown origin) in human U2OS cells assessed as reduction in pSER520 autophosphorylation incubated for 5 ...
Ligand InfoPC cidPC sid
In DepthDetails ArticlePubMed
TargetDual specificity tyrosine-phosphorylation-regulated kinase 2(Homo sapiens (Human))
Servier Research Institute Of Medicinal Chemistry
Curated by ChEMBL
LigandPNGBDBM50583750(CHEMBL5072926)
Affinity DataIC50:  9nM. Assay description: Inhibition of DYRK2 (unknown origin) using Ulight-MBP as substrate and ATP as co-substrate incubated for 40 mins and measured after 1 hr by TR-FRET a...
Ligand InfoPC cidPC sid
In DepthDetails ArticlePubMed
TargetCyclin-dependent kinase 9(Homo sapiens (Human))
Servier Research Institute Of Medicinal Chemistry
Curated by ChEMBL
LigandPNGBDBM50583750(CHEMBL5072926)
Affinity DataIC50:  470nM. Assay description: Inhibition of CDK9 (unknown origin) using Ulight-MBP as substrate and ATP as co-substrate incubated for 40 mins and measured after 1 hr by TR-FRET as...
Ligand InfoPC cidPC sid
In DepthDetails ArticlePubMed