BDBM50583767 CHEMBL5075638
SMILES [#7]-[#6](=[#7])-[#7]-[#6]-[#6]-[#6]-[#6@@H](-[#7]-[#6](=O)\[#6]=[#6](\c1ccccc1)-c1ccccc1)-[#6](=O)-[#7]-[#6@@H](-[#6]-[#6]-c1ccccc1)-[#6](-[#7])=O
InChI Key InChIKey=UVPXCTIIUXCMDY-RRPNLBNLSA-N
Data  2 KI
  Tab Delimited (TSV)   2D SDfile   Computed 3D by Vconf -m prep SDfile
Find this compound or compounds like it in BindingDB:
Activity Spreadsheet -- Enzyme Inhibition Constant Data from BindingDB
Found 2 hits for monomerid = 50583767
TargetNeuropeptide FF receptor 1(Homo sapiens (Human))
Universit£
Curated by ChEMBL
LigandPNGBDBM50583767(CHEMBL5075638)
Affinity DataKi:  6.60nM. Assay description: Displacement of [125I]-1DMeNPFF from recombinant human NPFF1 receptor expressed in CHO cells by TopCount scintillation counting method
Ligand InfoPC cidPC sid
In DepthDetails ArticlePubMed
TargetNeuropeptide FF receptor 2(Homo sapiens (Human))
Universit£
Curated by ChEMBL
LigandPNGBDBM50583767(CHEMBL5075638)
Affinity DataKi:  557nM. Assay description: Displacement of [125I]-1DMeNPFF from recombinant human NPFF2 receptor expressed in CHO cells by TopCount scintillation counting method
Ligand InfoPC cidPC sid
In DepthDetails ArticlePubMed