BDBM50584932 CHEMBL5087156
SMILES [H][C@]12Cc3ccccc3[C@]([H])(CNC1=O)N2C(=O)c1cc(OC)c2[nH]nc(C)c2c1
InChI Key
Data  4 IC50
  Tab Delimited (TSV)   2D SDfile   Computed 3D by Vconf -m prep SDfile
Find this compound or compounds like it in BindingDB:
Activity Spreadsheet -- Enzyme Inhibition Constant Data from BindingDB
Found 4 hits for monomerid = 50584932
TargetATPase family AAA domain-containing protein 2(Homo sapiens (Human))
Astrazeneca
Curated by ChEMBL
LigandPNGBDBM50584932(CHEMBL5087156)
Affinity DataIC50:  5.01E+3nM. Assay description: Inhibition of GST-ATAD2 BD (981 to 1108 residues) (unknown origin) expressed in Escherichia coli BL21 (DE3) and biotinylated tetra-acetylated histone...
Ligand InfoPC cidPC sid
In DepthDetails ArticlePubMed
TargetBromodomain-containing protein 4(Homo sapiens (Human))
Astrazeneca
Curated by ChEMBL
LigandPNGBDBM50584932(CHEMBL5087156)
Affinity DataIC50: <3.16E+4nM. Assay description: Displacement of Alexafluor 647-JQ1 from GST-BRD4 BD1 BD2 (44 to 460 residues) (unknown origin) incubated for 60 mins by fluorescence polarization ass...
Ligand InfoPC cidPC sid
In DepthDetails ArticlePubMed
TargetATPase family AAA domain-containing protein 2(Homo sapiens (Human))
Astrazeneca
Curated by ChEMBL
LigandPNGBDBM50584932(CHEMBL5087156)
Affinity DataIC50: <2.51E+5nM. Assay description: Inhibition of GST-ATAD2 BD (951 to 1132 residues) (unknown origin) expressed in Escherichia coli BL21 (DE3) and biotinylated tetra-acetylated histone...
Ligand InfoPC cidPC sid
In DepthDetails ArticlePubMed
TargetATPase family AAA domain-containing protein 2(Homo sapiens (Human))
Astrazeneca
Curated by ChEMBL
LigandPNGBDBM50584932(CHEMBL5087156)
Affinity DataIC50:  4.88E+3nM. Assay description: Inhibition of GST-ATAD2 BD (951 to 1132 residues) (unknown origin) expressed in Escherichia coli BL21 (DE3) and biotinylated tetra-acetylated histone...
Ligand InfoPC cidPC sid
In DepthDetails ArticlePubMed