BDBM50584934 CHEMBL5090538
SMILES [H][C@]12Cc3ccccc3[C@]([H])(CN(C)C1=O)N2C(=O)c1cn(C)c(=O)c2[nH]ccc12
InChI Key
Data  4 IC50
  Tab Delimited (TSV)   2D SDfile   Computed 3D by Vconf -m prep SDfile
Find this compound or compounds like it in BindingDB:
Activity Spreadsheet -- Enzyme Inhibition Constant Data from BindingDB
Found 4 hits for monomerid = 50584934
TargetATPase family AAA domain-containing protein 2(Homo sapiens (Human))
Astrazeneca
Curated by ChEMBL
LigandPNGBDBM50584934(CHEMBL5090538)
Affinity DataIC50:  3.16E+3nM. Assay description: Inhibition of GST-ATAD2 BD (981 to 1108 residues) (unknown origin) expressed in Escherichia coli BL21 (DE3) and biotinylated tetra-acetylated histone...
Ligand InfoPC cidPC sid
In DepthDetails ArticlePubMed
TargetBromodomain-containing protein 4(Homo sapiens (Human))
Astrazeneca
Curated by ChEMBL
LigandPNGBDBM50584934(CHEMBL5090538)
Affinity DataIC50:  7.94E+3nM. Assay description: Displacement of Alexafluor 647-JQ1 from GST-BRD4 BD1 BD2 (44 to 460 residues) (unknown origin) incubated for 60 mins by fluorescence polarization ass...
Ligand InfoPC cidPC sid
In DepthDetails ArticlePubMed
TargetATPase family AAA domain-containing protein 2(Homo sapiens (Human))
Astrazeneca
Curated by ChEMBL
LigandPNGBDBM50584934(CHEMBL5090538)
Affinity DataIC50: <2.51E+4nM. Assay description: Inhibition of GST-ATAD2 BD (951 to 1132 residues) (unknown origin) expressed in Escherichia coli BL21 (DE3) and biotinylated tetra-acetylated histone...
Ligand InfoPC cidPC sid
In DepthDetails ArticlePubMed
TargetATPase family AAA domain-containing protein 2(Homo sapiens (Human))
Astrazeneca
Curated by ChEMBL
LigandPNGBDBM50584934(CHEMBL5090538)
Affinity DataIC50:  3.56E+3nM. Assay description: Inhibition of GST-ATAD2 BD (951 to 1132 residues) (unknown origin) expressed in Escherichia coli BL21 (DE3) and biotinylated tetra-acetylated histone...
Ligand InfoPC cidPC sid
In DepthDetails ArticlePubMed