BDBM50584947 CHEMBL5074478
SMILES CC1=C(C#N)c2nc(N)c(C#N)c(C)c2\C1=C/c1ccc(o1)-c1cc(ccc1Cl)C(O)=O
InChI Key InChIKey=CKEZGFZETZHCNE-NVNXTCNLSA-N
Data  1 IC50
  Tab Delimited (TSV)   2D SDfile   Computed 3D by Vconf -m prep SDfile
Find this compound or compounds like it in BindingDB:
Activity Spreadsheet -- Enzyme Inhibition Constant Data from BindingDB
Found 1 hit for monomerid = 50584947
TargetATPase family AAA domain-containing protein 2(Homo sapiens (Human))
Astrazeneca
Curated by ChEMBL
LigandPNGBDBM50584947(CHEMBL5074478)
Affinity DataIC50:  3.16E+3nM. Assay description: Inhibition of GST-ATAD2 BD (981 to 1108 residues) (unknown origin) expressed in Escherichia coli BL21 (DE3) and biotinylated tetra-acetylated histone...
Ligand InfoPC cidPC sid
In DepthDetails ArticlePubMed