BDBM512525 acs.jmedchem.1c00409_ST.118
SMILES O=C(N[C@@H](CC1CCCCC1)C(=O)N[C@@H](C[C@@H]1CCNC1=O)C(=O)C(=O)NCc1ccccc1)C=Cc1ccccc1
InChI Key InChIKey=QTGORSKTHIBLJT-FIVJMQNTSA-N
Data  2 IC50  1 EC50
  Tab Delimited (TSV)   2D SDfile   Computed 3D by Vconf -m prep SDfile
Find this compound or compounds like it in BindingDB:
Activity Spreadsheet -- Enzyme Inhibition Constant Data from BindingDB
Found 3 hits for monomerid = 512525
TargetReplicase polyprotein 1ab(Human SARS coronavirus (SARS-CoV) (Severe acute re...)
Michigan State University
LigandPNGBDBM512525(acs.jmedchem.1c00409_ST.118)
Affinity DataEC50:  1.40E+3nM. Assay description: This is a review article. Please point to the original journal.
Ligand InfoPC cidPC sid
In DepthDetails ArticlePubMed
TargetReplicase polyprotein 1ab(2019-nCoV)
Michigan State University
LigandPNGBDBM512525(acs.jmedchem.1c00409_ST.118)
Affinity DataIC50:  180nM. Assay description: This is a review article. Please point to the original journal.
Ligand InfoPC cidPC sid
In DepthDetails ArticlePubMed
TargetReplicase polyprotein 1ab(Human SARS coronavirus (SARS-CoV) (Severe acute re...)
Michigan State University
LigandPNGBDBM512525(acs.jmedchem.1c00409_ST.118)
Affinity DataIC50:  710nM. Assay description: This is a review article. Please point to the original journal.
Ligand InfoPC cidPC sid
In DepthDetails ArticlePubMed