BDBM512691 acs.jmedchem.1c00409_ST.285
SMILES O=C(N[C@@H](Cc1ccccc1)C(=O)N[C@@H](CC1CCNC1=O)C(=O)C(=O)NCc1ccccc1)C=Cc1ccccc1
InChI Key InChIKey=MYYPGCLXUFVQGN-OFUOTVDYSA-N
Data  1 IC50  1 EC50
  Tab Delimited (TSV)   2D SDfile   Computed 3D by Vconf -m prep SDfile
Find this compound or compounds like it in BindingDB:
Activity Spreadsheet -- Enzyme Inhibition Constant Data from BindingDB
Found 2 hits for monomerid = 512691
TargetReplicase polyprotein 1ab(Human SARS coronavirus (SARS-CoV) (Severe acute re...)
Michigan State University
LigandPNGBDBM512691(acs.jmedchem.1c00409_ST.285)
Affinity DataIC50:  1.95E+3nM. Assay description: This is a review article. Please point to the original journal.
Ligand InfoPC cidPC sid
In DepthDetails ArticlePubMed
TargetReplicase polyprotein 1ab(Human SARS coronavirus (SARS-CoV) (Severe acute re...)
Michigan State University
LigandPNGBDBM512691(acs.jmedchem.1c00409_ST.285)
Affinity DataEC50:  2.00E+3nM. Assay description: This is a review article. Please point to the original journal.
Ligand InfoPC cidPC sid
In DepthDetails ArticlePubMed