BDBM514217 N-(1-cyanopyrrolidin-3-yl)-4- phenylthiazole-2-carboxamide::US11053198, Example 7
SMILES O=C(N[C@@H]1CCN(C1)C#N)c1nc(cs1)-c1ccccc1
InChI Key InChIKey=IKWTYCKYUFAZEW-GFCCVEGCSA-N
Data  1 IC50
  Tab Delimited (TSV)   2D SDfile   Computed 3D by Vconf -m prep SDfile
Find this compound or compounds like it in BindingDB:
Activity Spreadsheet -- Enzyme Inhibition Constant Data from BindingDB
Found 1 hit for monomerid = 514217
TargetUbiquitin carboxyl-terminal hydrolase 30(Homo sapiens (Human))
Mission Therapeutics
US Patent
LigandPNGBDBM514217(N-(1-cyanopyrrolidin-3-yl)-4- phenylthiazole-2-car...)
Affinity DataIC50:  550nM. Assay description: Dilution plates were prepared at 21 times the final concentration (2100 μM for a final concentration of 100 μM) in 50% DMSO in a 96-well po...
Ligand InfoPC cidPC sid
In DepthDetails US Patent