BDBM514219 N-(1-cyanopyrrolidin-3-yl)-1- phenyl-1H-imidazole-4- carboxamide::US11053198, Example 9::US11390584, Example 9
SMILES O=C(N[C@@H]1CCN(C1)C#N)c1cn(cn1)-c1ccccc1
InChI Key InChIKey=MPKZLRHBQCYRIQ-GFCCVEGCSA-N
Data  2 IC50
  Tab Delimited (TSV)   2D SDfile   Computed 3D by Vconf -m prep SDfile
Find this compound or compounds like it in BindingDB:
Activity Spreadsheet -- Enzyme Inhibition Constant Data from BindingDB
Found 2 hits for monomerid = 514219
TargetUbiquitin carboxyl-terminal hydrolase 30(Homo sapiens (Human))
Mission Therapeutics
US Patent
LigandPNGBDBM514219(N-(1-cyanopyrrolidin-3-yl)-1- phenyl-1H-imidazole-...)
Affinity DataIC50:  550nM. Assay description: Dilution plates were prepared at 21 times the final concentration (2100 μM for a final concentration of 100 μM) in 50% DMSO in a 96-well po...
Ligand InfoPC cidPC sid
In DepthDetails US Patent
TargetUbiquitin carboxyl-terminal hydrolase 30(Homo sapiens (Human))
Mission Therapeutics
US Patent
LigandPNGBDBM514219(N-(1-cyanopyrrolidin-3-yl)-1- phenyl-1H-imidazole-...)
Affinity DataIC50:  550nM. Assay description: Dilution plates were prepared at 21 times the final concentration (2100 μM for a final concentration of 100 μM) in 50% DMSO in a 96-well po...
Ligand InfoPC cidPC sid
In DepthDetails US Patent