BDBM51743 2-(furan-2-yl)-N'-(phenylcarbonyl)quinoline-4-carbohydrazide::MLS001006540::N'-benzoyl-2-(2-furanyl)-4-quinolinecarbohydrazide::N'-benzoyl-2-(2-furyl)cinchoninohydrazide::N'-benzoyl-2-(furan-2-yl)quinoline-4-carbohydrazide::SMR000349485::cid_2423303
SMILES O=C(NNC(=O)c1cc(nc2ccccc12)-c1ccco1)c1ccccc1
InChI Key InChIKey=KZCRENSGALAUQA-UHFFFAOYSA-N
Data  1 IC50
  Tab Delimited (TSV)   2D SDfile   Computed 3D by Vconf -m prep SDfile
Find this compound or compounds like it in BindingDB:
Activity Spreadsheet -- Enzyme Inhibition Constant Data from BindingDB
Found 1 hit for monomerid = 51743
TargetdTDP-4-dehydrorhamnose 3,5-epimerase(Mycobacterium tuberculosis H37Rv)
Pcmd
Curated by PubChem BioAssay
LigandPNGBDBM51743(2-(furan-2-yl)-N'-(phenylcarbonyl)quinoline-4-carb...)
Affinity DataIC50:  1.17E+4nM. Assay description: Molecular Library Screening Center Network (MLSCN) Penn Center for Molecular Discovery (PCMD) Assay Provider: Michael McNeil, Colorado State Universi...
In DepthDetails PCBioAssay