BDBM521947 N-[3-[6-(difluoromethoxy)-2- methyl-3,4-dihydro-2H-1,4- benzothiazin-7-yl]-1H- pyrazol-4-yl]pyrazolo[1,5- a]pyrimidine-3-carboxamide::US11155557, Example 37::US11155557, Example 93::US11155557, Example 94
SMILES CC1CNc2cc(OC(F)F)c(cc2S1)-c1n[nH]cc1NC(=O)c1cnn2cccnc12
InChI Key
Data  6 KI
  Tab Delimited (TSV)   2D SDfile   Computed 3D by Vconf -m prep SDfile
Find this compound or compounds like it in BindingDB:
Activity Spreadsheet -- Enzyme Inhibition Constant Data from BindingDB
Found 6 hits for monomerid = 521947
TargetTyrosine-protein kinase JAK2(Homo sapiens (Human))
Genentech
US Patent
LigandPNGBDBM521947(N-[3-[6-(difluoromethoxy)-2- methyl-3,4-dihydro-2H...)
Affinity DataKi:  0.0300nM. Assay description: The activity of the isolated recombinant JAK1 and JAK2 kinase domain was measured by monitoring phosphorylation of a peptide derived from JAK3 (Val-A...
Ligand InfoPC cidPC sid
In DepthDetails US Patent
TargetTyrosine-protein kinase JAK2(Homo sapiens (Human))
Genentech
US Patent
LigandPNGBDBM521947(N-[3-[6-(difluoromethoxy)-2- methyl-3,4-dihydro-2H...)
Affinity DataKi:  0.0500nM. Assay description: The activity of the isolated recombinant JAK1 and JAK2 kinase domain was measured by monitoring phosphorylation of a peptide derived from JAK3 (Val-A...
Ligand InfoPC cidPC sid
In DepthDetails US Patent
TargetTyrosine-protein kinase JAK2(Homo sapiens (Human))
Genentech
US Patent
LigandPNGBDBM521947(N-[3-[6-(difluoromethoxy)-2- methyl-3,4-dihydro-2H...)
Affinity DataKi:  0.0500nM. Assay description: The activity of the isolated recombinant JAK1 and JAK2 kinase domain was measured by monitoring phosphorylation of a peptide derived from JAK3 (Val-A...
Ligand InfoPC cidPC sid
In DepthDetails US Patent
TargetTyrosine-protein kinase JAK1(Homo sapiens (Human))
Genentech
US Patent
LigandPNGBDBM521947(N-[3-[6-(difluoromethoxy)-2- methyl-3,4-dihydro-2H...)
Affinity DataKi:  0.0700nM. Assay description: The activity of the isolated recombinant JAK1 and JAK2 kinase domain was measured by monitoring phosphorylation of a peptide derived from JAK3 (Val-A...
Ligand InfoPC cidPC sid
In DepthDetails US Patent
TargetTyrosine-protein kinase JAK1(Homo sapiens (Human))
Genentech
US Patent
LigandPNGBDBM521947(N-[3-[6-(difluoromethoxy)-2- methyl-3,4-dihydro-2H...)
Affinity DataKi:  0.0700nM. Assay description: The activity of the isolated recombinant JAK1 and JAK2 kinase domain was measured by monitoring phosphorylation of a peptide derived from JAK3 (Val-A...
Ligand InfoPC cidPC sid
In DepthDetails US Patent
TargetTyrosine-protein kinase JAK1(Homo sapiens (Human))
Genentech
US Patent
LigandPNGBDBM521947(N-[3-[6-(difluoromethoxy)-2- methyl-3,4-dihydro-2H...)
Affinity DataKi:  0.0700nM. Assay description: The activity of the isolated recombinant JAK1 and JAK2 kinase domain was measured by monitoring phosphorylation of a peptide derived from JAK3 (Val-A...
Ligand InfoPC cidPC sid
In DepthDetails US Patent