BDBM521950 N-[3-[6-(difluoromethoxy)-3- oxo-4H-1,4-benzoxazin-7-yl]- 1H-pyrazol-4-yl]pyrazolo[1,5- a]pyrimidine-3-carboxamide::US11155557, Example 40
SMILES FC(F)Oc1cc2NC(=O)COc2cc1-c1n[nH]cc1NC(=O)c1cnn2cccnc12
InChI Key InChIKey=FIWZXYWXBGFQSA-UHFFFAOYSA-N
Data  2 KI
  Tab Delimited (TSV)   2D SDfile   Computed 3D by Vconf -m prep SDfile
Find this compound or compounds like it in BindingDB:
Activity Spreadsheet -- Enzyme Inhibition Constant Data from BindingDB
Found 2 hits for monomerid = 521950
TargetTyrosine-protein kinase JAK2(Homo sapiens (Human))
Genentech
US Patent
LigandPNGBDBM521950(N-[3-[6-(difluoromethoxy)-3- oxo-4H-1,4-benzoxazin...)
Affinity DataKi:  0.0600nM. Assay description: The activity of the isolated recombinant JAK1 and JAK2 kinase domain was measured by monitoring phosphorylation of a peptide derived from JAK3 (Val-A...
Ligand InfoPC cidPC sid
In DepthDetails US Patent
TargetTyrosine-protein kinase JAK1(Homo sapiens (Human))
Genentech
US Patent
LigandPNGBDBM521950(N-[3-[6-(difluoromethoxy)-3- oxo-4H-1,4-benzoxazin...)
Affinity DataKi:  0.0900nM. Assay description: The activity of the isolated recombinant JAK1 and JAK2 kinase domain was measured by monitoring phosphorylation of a peptide derived from JAK3 (Val-A...
Ligand InfoPC cidPC sid
In DepthDetails US Patent