BDBM522038 N-[3-[6-(difluoromethoxy)- 3,4-dihydro-2H-1,4- benzothiazin-7-yl]-1-[(2- methyltetrazol-5- yl)methyl]pyrazol-4- yl]pyrazolo[1,5-a]pyrimidine- 3-carboxamide::US11155557, Example 128
SMILES Cn1nnc(Cn2cc(NC(=O)c3cnn4cccnc34)c(n2)-c2cc3SCCNc3cc2OC(F)F)n1
InChI Key InChIKey=FYTBERZHHUHMHE-UHFFFAOYSA-N
Data  2 KI
  Tab Delimited (TSV)   2D SDfile   Computed 3D by Vconf -m prep SDfile
Find this compound or compounds like it in BindingDB:
Activity Spreadsheet -- Enzyme Inhibition Constant Data from BindingDB
Found 2 hits for monomerid = 522038
TargetTyrosine-protein kinase JAK2(Homo sapiens (Human))
Genentech
US Patent
LigandPNGBDBM522038(N-[3-[6-(difluoromethoxy)- 3,4-dihydro-2H-1,4- ben...)
Affinity DataKi:  0.0900nM. Assay description: The activity of the isolated recombinant JAK1 and JAK2 kinase domain was measured by monitoring phosphorylation of a peptide derived from JAK3 (Val-A...
Ligand InfoPC cidPC sid
In DepthDetails US Patent
TargetTyrosine-protein kinase JAK1(Homo sapiens (Human))
Genentech
US Patent
LigandPNGBDBM522038(N-[3-[6-(difluoromethoxy)- 3,4-dihydro-2H-1,4- ben...)
Affinity DataKi:  0.140nM. Assay description: The activity of the isolated recombinant JAK1 and JAK2 kinase domain was measured by monitoring phosphorylation of a peptide derived from JAK3 (Val-A...
Ligand InfoPC cidPC sid
In DepthDetails US Patent