BDBM522578 7-methyl-9-(4-(1-methyl-::US11161848, Compound I-136
SMILES Cn1cc(nc1-c1ccc(Cn2c3nc(ncc3n(C)c2=O)-c2cccnc2C2CC(C2)C(F)(F)F)cc1)C(F)(F)F
InChI Key InChIKey=XFAYGLQQNXQPSR-UHFFFAOYSA-N
Data  1 IC50
  Tab Delimited (TSV)   2D SDfile   Computed 3D by Vconf -m prep SDfile
Find this compound or compounds like it in BindingDB:
Activity Spreadsheet -- Enzyme Inhibition Constant Data from BindingDB
Found 1 hit for monomerid = 522578
TargetUbiquitin carboxyl-terminal hydrolase 1(Homo sapiens (Human))
Forma Therapeutics
US Patent
LigandPNGBDBM522578(7-methyl-9-(4-(1-methyl- | US11161848, Compound I-...)
Affinity DataIC50:  125nM. Assay description: The HTS assay was performed in a final volume of 20 μL in assay buffer containing 20 mM Tris-HCl (pH 8.0, (1M Tris-HCl, pH 8.0 solution; Corning...
Ligand InfoPC cidPC sid
In DepthDetails US Patent