BDBM524280 Preparation of Methyl 4-(1-((2-(dimethylamino)thiazol-4-yl)methyl)-4-methyl-1H-pyrrole-2-carboxamido)benzoate::US11168080, Compound A-47
SMILES CN(C)c1ncc(Cn2cc(C)cc2C(=O)Nc2ccc(cc2)C(O)=O)s1
InChI Key InChIKey=CSLRQWLLJOBMPL-UHFFFAOYSA-N
Data  1 IC50
  Tab Delimited (TSV)   2D SDfile   Computed 3D by Vconf -m prep SDfile
Find this compound or compounds like it in BindingDB:
Activity Spreadsheet -- Enzyme Inhibition Constant Data from BindingDB
Found 1 hit for monomerid = 524280
TargetDynamin-1-like protein(Human)
Mitobridge
US Patent
LigandPNGBDBM524280(Preparation of Methyl 4-(1-((2-(dimethylamino)thia...)
Affinity DataIC50:  1.63E+4nM. Assay description: The GTPase activity of Drp1 was assayed using a colorimetric assay similar to as described previously by Leonard M. et al. “Robust colorimetric assay...
Ligand InfoPC cidPC sid
In DepthDetails US Patent