BDBM52934 MLS000860958::N'4-benzoyl-2-(3-pyridyl)-1,3-thiazole-4-carbohydrazide::N'-(phenylcarbonyl)-2-pyridin-3-yl-1,3-thiazole-4-carbohydrazide::N'-benzoyl-2-(3-pyridinyl)-4-thiazolecarbohydrazide::N'-benzoyl-2-(3-pyridyl)thiazole-4-carbohydrazide::N'-benzoyl-2-pyridin-3-yl-1,3-thiazole-4-carbohydrazide::SMR000459742::cid_2824173
SMILES O=C(NNC(=O)c1ccccc1)c1csc(n1)-c1cccnc1
InChI Key InChIKey=IULXYATWZVFRIR-UHFFFAOYSA-N
Data  2 EC50
  Tab Delimited (TSV)   2D SDfile   Computed 3D by Vconf -m prep SDfile
Find this compound or compounds like it in BindingDB:
Activity Spreadsheet -- Enzyme Inhibition Constant Data from BindingDB
Found 2 hits for monomerid = 52934
TargetZinc finger protein mex-5(Caenorhabditis elegans)
Broad Institute
Curated by PubChem BioAssay
LigandPNGBDBM52934(MLS000860958 | N'4-benzoyl-2-(3-pyridyl)-1,3-t...)
Affinity DataEC50:  3.00E+5nM. Assay description: Broad Institute: MLPCN maternal gene expression Project ID: 2024 Keywords: Zinc finger, C. elegans, maternal gene expression, RNA-protein interac...
In DepthDetails PCBioAssay
TargetPOsterior Segregation(Caenorhabditis elegans)
Broad Institute
Curated by PubChem BioAssay
LigandPNGBDBM52934(MLS000860958 | N'4-benzoyl-2-(3-pyridyl)-1,3-t...)
Affinity DataEC50:  3.00E+5nM. Assay description: Broad Institute: MLPCN maternal gene expression Project ID: 2024 Keywords: Zinc finger, C. elegans, maternal gene expression, RNA-protein interac...
In DepthDetails PCBioAssay