BDBM532269 4-(2-Anilinopyrimidin-4-yl)-6-[3-(trifluoromethyl)morpholin-4-yl]-1H-pyridin-2-one::US11208423, Example 27::US11780858, Example 27
SMILES FC(F)(F)C1COCCN1c1cc(cc(=O)[nH]1)-c1ccnc(Nc2ccccc2)n1
InChI Key
Data  2 IC50
  Tab Delimited (TSV)   2D SDfile   Computed 3D by Vconf -m prep SDfile
Find this compound or compounds like it in BindingDB:
Activity Spreadsheet -- Enzyme Inhibition Constant Data from BindingDB
Found 2 hits for monomerid = 532269
TargetPhosphatidylinositol 3-kinase catalytic subunit type 3(Homo sapiens (Human))
Sprint Bioscience
US Patent
LigandPNGBDBM532269(4-(2-Anilinopyrimidin-4-yl)-6-[3-(trifluoromethyl)...)
Affinity DataIC50: <5nM. Assay description: Dilution series of compounds of the invention were prepared in DMSO at 100 times the final assay concentration (n1=n0/3 in 10 points). The compounds ...
Ligand InfoPC cidPC sid
In DepthDetails US Patent
TargetPhosphatidylinositol 3-kinase catalytic subunit type 3(Homo sapiens (Human))
Sprint Bioscience
US Patent
LigandPNGBDBM532269(4-(2-Anilinopyrimidin-4-yl)-6-[3-(trifluoromethyl)...)
Affinity DataIC50: <5nM. Assay description: Dilution series of compounds of the invention were prepared in DMSO at 100 times the final assay concentration (n1=n0/3 in 10 points). The compounds ...
Ligand InfoPC cidPC sid
In DepthDetails US Patent