BDBM532961 N-[4-[2-oxo-6-[3-(trifluoromethyl)morpholin-4-yl]-1H-pyridin-4-yl]-2-pyridyl]acetamide::US11219618, Example 26
SMILES CC(=O)Nc1cc(ccn1)-c1cc([nH]c(=O)c1)N1CCOCC1C(F)(F)F
InChI Key
Data  1 IC50
  Tab Delimited (TSV)   2D SDfile   Computed 3D by Vconf -m prep SDfile
Find this compound or compounds like it in BindingDB:
Activity Spreadsheet -- Enzyme Inhibition Constant Data from BindingDB
Found 1 hit for monomerid = 532961
TargetPhosphatidylinositol 3-kinase catalytic subunit type 3(Homo sapiens (Human))
Sprint Bioscience
US Patent
LigandPNGBDBM532961(N-[4-[2-oxo-6-[3-(trifluoromethyl)morpholin-4-yl]-...)
Affinity DataIC50: <5nM. Assay description: Dilution series of compounds of the invention were prepared in DMSO at 100 times the final assay concentration (n1=n0/3 in 10 points). The compounds ...
Ligand InfoPC cidPC sid
In DepthDetails US Patent