BDBM532965 N-[4-[2-oxo-6-[2-(trifluoromethyl)-3-pyridyl]-1H-pyridin-4-yl]-2-pyridyl]acetamide::US11219618, Example 36
SMILES CC(=O)Nc1cc(ccn1)-c1cc([nH]c(=O)c1)-c1cccnc1C(F)(F)F
InChI Key InChIKey=FMUDKKVYHUYDHN-UHFFFAOYSA-N
Data  1 IC50
  Tab Delimited (TSV)   2D SDfile   Computed 3D by Vconf -m prep SDfile
Find this compound or compounds like it in BindingDB:
Activity Spreadsheet -- Enzyme Inhibition Constant Data from BindingDB
Found 1 hit for monomerid = 532965
TargetPhosphatidylinositol 3-kinase catalytic subunit type 3(Homo sapiens (Human))
Sprint Bioscience
US Patent
LigandPNGBDBM532965(N-[4-[2-oxo-6-[2-(trifluoromethyl)-3-pyridyl]-1H-p...)
Affinity DataIC50: <5nM. Assay description: Dilution series of compounds of the invention were prepared in DMSO at 100 times the final assay concentration (n1=n0/3 in 10 points). The compounds ...
Ligand InfoPC cidPC sid
In DepthDetails US Patent