BDBM533857 Methyl 2-chloro-5-(3-(4-(methylcarbamoyl)phenyl)pyrazolo[1,5-a]pyridine-5- carboxamido)benzoate::WO2022079616, Example 1.24
SMILES CNC(=O)c1ccc(cc1)-c1cnn2ccc(cc12)C(=O)Nc1ccc(Cl)c(c1)C(=O)OC
InChI Key InChIKey=GIPYJJIRNGPVRR-UHFFFAOYSA-N
Data  2 IC50
  Tab Delimited (TSV)   2D SDfile   Computed 3D by Vconf -m prep SDfile
Find this compound or compounds like it in BindingDB:
Activity Spreadsheet -- Enzyme Inhibition Constant Data from BindingDB
Found 2 hits for monomerid = 533857
LigandPNGBDBM533857(Methyl 2-chloro-5-(3-(4-(methylcarbamoyl)phenyl)py...)
Affinity DataIC50: >1.00E+3nM
Ligand InfoPC cidPC sid
In DepthDetails PubMed
TargetPhosphatidylinositol 4-kinase()
Novartis
WIPO
LigandPNGBDBM533857(Methyl 2-chloro-5-(3-(4-(methylcarbamoyl)phenyl)py...)
Affinity DataIC50: >1.00E+3nM. Assay description:  Baculovirus expression and purification of C. parvum phosphatidylinositol 4-kinase: The full-length coding sequence of C. parvum PI(4)K (cgd8_4500, ...
Ligand InfoPC cidPC sid
In DepthDetails PubMed