BDBM53704 4-chloro-3-(2,3-dihydro-1,4-benzodioxin-6-ylsulfonylamino)benzoic acid methyl ester::MLS000097133::SMR000076660::cid_2955394::methyl 4-chloranyl-3-(2,3-dihydro-1,4-benzodioxin-6-ylsulfonylamino)benzoate::methyl 4-chloro-3-(2,3-dihydro-1,4-benzodioxin-6-ylsulfonylamino)benzoate::methyl 4-chloro-3-[(2,3-dihydro-1,4-benzodioxin-6-ylsulfonyl)amino]benzoate
SMILES COC(=O)c1ccc(Cl)c(NS(=O)(=O)c2ccc3OCCOc3c2)c1
InChI Key InChIKey=JAUDXUKDOCZJHX-UHFFFAOYSA-N
Data  1 IC50
  Tab Delimited (TSV)   2D SDfile   Computed 3D by Vconf -m prep SDfile
Find this compound or compounds like it in BindingDB:
Activity Spreadsheet -- Enzyme Inhibition Constant Data from BindingDB
Found 1 hit for monomerid = 53704
TargetM1 family aminopeptidase(Plasmodium falciparum (isolate FcB1 / Columbia))
Srmlsc
Curated by PubChem BioAssay
LigandPNGBDBM53704(4-chloro-3-(2,3-dihydro-1,4-benzodioxin-6-ylsulfon...)
Affinity DataIC50:  2.97E+4nM. Assay description: Southern Research Molecular Libraries Screening Center (SRMLSC) Southern Research Institute (Birmingham, Alabama) NIH Molecular Libraries Screening...
In DepthDetails PCBioAssay