BDBM548054 WO2022091056, Example 46
SMILES C[C@H]1CCC(CC1)[C@H](NC(=O)c1ccnn1C)C(=O)Nc1ccc(cc1)-c1c(Cl)cc[n+]([O-])c1C
InChI Key InChIKey=QLBHSINUQXTLNB-WYTDWXGPSA-N
Data  1 IC50
  Tab Delimited (TSV)   2D SDfile   Computed 3D by Vconf -m prep SDfile
Find this compound or compounds like it in BindingDB:
Activity Spreadsheet -- Enzyme Inhibition Constant Data from BindingDB
Found 1 hit for monomerid = 548054
TargetInterleukin-17 receptor A/(Homo sapiens (Human))
Novartis
WIPO
LigandPNGBDBM548054(WO2022091056, Example 46)
Affinity DataIC50:  18nM. Assay description:  Dilutions of test compounds in DMSO are plated onto white low-volume 384-well plates (Greiner, #784075). Specifically, solutions of graded concentra...
Ligand InfoPC cidPC sid
In DepthDetails PubMed