BDBM548279 WO2022093820, Compound 47
SMILES CC[C@H]1CNC(=O)c2cc(nn12)N1CCOC[C@H]1C
InChI Key InChIKey=JUTTZZKQKJYQCE-ZJUUUORDSA-N
Data  1 IC50
  Tab Delimited (TSV)   2D SDfile   Computed 3D by Vconf -m prep SDfile
Find this compound or compounds like it in BindingDB:
Activity Spreadsheet -- Enzyme Inhibition Constant Data from BindingDB
Found 1 hit for monomerid = 548279
TargetPhosphatidylinositol 3-kinase catalytic subunit type 3(Homo sapiens (Human))
Genentech
WIPO
LigandPNGBDBM548279(WO2022093820, Compound 47)
Affinity DataIC50:  747nM. Assay description:  [0194] Experimental compound in DMSO was dispensed to a 384-well microplate via acoustic dispenser at 50 nl per well. At 2.5 µl per well, an enzyme ...
Ligand InfoPC cidPC sid
In DepthDetails PubMed